{"text_format":"1","workbook":"xlsx","n_sheets":12,"sheets":["Cover","Table of Contens","Top-down Prg. Status","Bottom-up Prg. Status","Timesheet raw data","Estimate to complete","Rolling plan","Traffic Light report","Scoreboard Risiken u. Chancen","Erläuterung Risiken+Chancen","Detailbewertung Risiken","Detailbewertung Chancen"],"not_rendered":{"charts":0,"images":8,"macros":1,"external_links":0,"defined_names":81,"comments":3,"pivot_tables":0},"unopened":[],"bounds":{"document_bytes":16777216,"sheet_cells":100000,"rows_first":2000,"rows_last":500,"rows_between":2000,"halvings":0,"cell_chars":16384,"cell_head_chars":4096},"cells_cut":0,"cells_raw":0,"read":"whole","date_system":"1900"}

{"sheet":"Cover","index":0,"n_rows":45,"n_cols":10,"rows_kept":45,"cut":false,"hidden":false,"merged":[]}
["cover"]
[null,null,"Handbook of Program Feedback Loops"]
[null,null,"Program:",{"$f":"Cover.ProgramName","v":"DEMO"},null,null,"v.0.9.Demo",null,null,"Select language"]
[]
[]
[]
[]
[]
[]
[]
{"$rows_left_out":36}
{"sheet":"Table of Contens","index":1,"n_rows":26,"n_cols":7,"rows_kept":26,"cut":false,"hidden":false,"merged":[[27,3,27,6],[18,4,20,5],[21,3,21,6],[23,3,23,6],[24,3,24,6],[25,3,25,6]]}
["toc"]
[null,null,"Table of contents"]
[null,null,"Program:",{"$f":"Cover.ProgramName","v":"DEMO"}]
[null,null,"Method","Sheet","Requ. for\nprogram?","Seclection","Print"]
[null,1,"Cover","Cover","R","x","x"]
[null,2,"Table of Contens","Table of Contens","R","x","x"]
[null,3,"Top-down Prg. Status","Top-down Prg. Status","R","x","x"]
[null,4,"Bottom-up Prg. Status","Bottom-up Prg. Status","R","x","x"]
[null,5,"Timesheet raw data","Timesheet raw data","R","x","-"]
[null,6,"Estimate to complete","Estimate to complete","R","x","x"]
{"$rows_left_out":17}
{"sheet":"Top-down Prg. Status","index":2,"n_rows":43,"n_cols":22,"rows_kept":43,"cut":false,"hidden":false,"merged":[[8,1,17,1],[30,1,39,1],[4,4,4,5]]}
["topdownpgs"]
[null,"Top-down Program Status"]
[null,null,"Program:",{"$f":"Cover.ProgramName","v":"DEMO"}]
[null,"CUSTOMER \"DEMO\" IMPLEMENTATION PROGRAM"]
[null,null,null,"PROGRAM STATUS DATE: ",{"$f":"MAX('Timesheet raw data'!C:C)","v":"2011-12-16"},null,null,"Update Top down status weekly!"]
[]
[null,null,null,"Draft Planning as of Sept 2011",null,null,null,null,null,null,null,null,null,null,null,null,null,null,null,null,null,"Total"]
[null,"Software","Project",null,"2011-09-01","2011-10-01","2011-11-01","2011-12-01","2012-01-01","2012-02-01","2012-03-01","2012-04-01","2012-05-01","2012-06-01","2012-07-01","2012-08-01","2012-09-01","2012-10-01","2012-11-01","2012-12-01",null,"Days"]
[null,"CA Service Desk Manager based","Tenant1","Incident Management",10,20,20,20,20,20,10,0,0,0,0,0,0,0,0,0,null,{"$f":"SUM(E9:U9)","v":120}]
[null,null,"Tenant2","Incident Management",0,5,15,15,15,15,15,15,5,0,0,0,0,0,0,0,null,{"$f":"SUM(E10:U10)","v":100}]
{"$rows_left_out":34}
{"sheet":"Bottom-up Prg. Status","index":3,"n_rows":79,"n_cols":13,"rows_kept":79,"cut":false,"hidden":false,"merged":[]}
["TandMstatus"]
[null,"Bottom-up Program Status"]
[null,"Program:",{"$f":"Cover.ProgramName","v":"DEMO"}]
[null,"CUSTOMER \"DEMO\" IMPLEMENTATION PROGRAM"]
[null,"PROGRAM STATUS DATE: ",{"$f":"MAX('Timesheet raw data'!C:C)","v":"2011-12-16"},null,"Update T&M status weekly!"]
[]
[null,"PROGRAM WORK PER RESOURCE NAME"]
[null,"Resource Name","Worked hours","Rate per hour","Role"]
[null,"Offshore Consultant1",{"$f":"SUMIF('Timesheet raw data'!B:B,B9,'Timesheet raw data'!E:E)","v":146},{"$f":"VLOOKUP(E9,$B$37:$I$44,2,FALSE)","v":65},"Offshore Consultant"]
[null,"Associate Consultant1",{"$f":"SUMIF('Timesheet raw data'!B:B,B10,'Timesheet raw data'!E:E)","v":0},75,"Associate Consultant"]
{"$rows_left_out":70}
{"sheet":"Timesheet raw data","index":4,"n_rows":307,"n_cols":11,"rows_kept":307,"cut":false,"hidden":false,"merged":[]}
["Timesheet"]
[null,null,"Timesheet raw data"]
[null,"Program:",{"$f":"Cover.ProgramName","v":"DEMO"}]
[null,"Enter timesheet data weekly!"]
[null,"Name","Date","Project","Hours","Month","BillAmt","Hrl Rate","Role","Hidden_Project+Role","Hidden_Project_Month"]
[null,"Architect2","2011-09-06","Tenant2 Incident Management",2,{"$f":"IF(C6<>\"\",TEXT(YEAR(C6),\"0000\")&\"-\"&TEXT(MONTH(C6),\"00\"),\"\")","v":"2011-09"},{"$f":"VLOOKUP(B6,Program.ResourceTable,3,FALSE)*E6","v":192},{"$f":"IF('Timesheet raw data'!E6>0,'Timesheet raw data'!G6/'Timesheet raw data'!E6,\"\")","v":96},{"$f":"IF(H6<>\"\",VLOOKUP(H6,Program.RateTable,2,FALSE),\"\")","v":"Architect"},{"$f":"'Timesheet raw data'!D6&I6","v":"Tenant2 Incident ManagementArchitect"},{"$f":"IF('Timesheet raw data'!D6<>\"\",'Timesheet raw data'!D6&\"-\"&'Timesheet raw data'!F6,\"\")","v":"Tenant2 Incident Management-2011-09"}]
[null,"Architect2","2011-09-06","Tenant2 Incident Management",4,{"$f":"IF(C7<>\"\",TEXT(YEAR(C7),\"0000\")&\"-\"&TEXT(MONTH(C7),\"00\"),\"\")","v":"2011-09"},384,{"$f":"IF('Timesheet raw data'!E7>0,'Timesheet raw data'!G7/'Timesheet raw data'!E7,\"\")","v":96},"Architect",{"$f":"'Timesheet raw data'!D7&I7","v":"Tenant2 Incident ManagementArchitect"},{"$f":"IF('Timesheet raw data'!D7<>\"\",'Timesheet raw data'!D7&\"-\"&'Timesheet raw data'!F7,\"\")","v":"Tenant2 Incident Management-2011-09"}]
[null,"Architect2","2011-09-07","Tenant2 Incident Management",2,"2011-09",192,{"$f":"IF('Timesheet raw data'!E8>0,'Timesheet raw data'!G8/'Timesheet raw data'!E8,\"\")","v":96},"Architect",{"$f":"'Timesheet raw data'!D8&I8","v":"Tenant2 Incident ManagementArchitect"},{"$f":"IF('Timesheet raw data'!D8<>\"\",'Timesheet raw data'!D8&\"-\"&'Timesheet raw data'!F8,\"\")","v":"Tenant2 Incident Management-2011-09"}]
[null,"Architect2","2011-09-09","Tenant2 Incident Management",2,"2011-09",192,{"$f":"IF('Timesheet raw data'!E9>0,'Timesheet raw data'!G9/'Timesheet raw data'!E9,\"\")","v":96},"Architect",{"$f":"'Timesheet raw data'!D9&I9","v":"Tenant2 Incident ManagementArchitect"},{"$f":"IF('Timesheet raw data'!D9<>\"\",'Timesheet raw data'!D9&\"-\"&'Timesheet raw data'!F9,\"\")","v":"Tenant2 Incident Management-2011-09"}]
[null,"Architect2","2011-09-12","Tenant2 Incident Management",2,"2011-09",192,{"$f":"IF('Timesheet raw data'!E10>0,'Timesheet raw data'!G10/'Timesheet raw data'!E10,\"\")","v":96},"Architect",{"$f":"'Timesheet raw data'!D10&I10","v":"Tenant2 Incident ManagementArchitect"},{"$f":"IF('Timesheet raw data'!D10<>\"\",'Timesheet raw data'!D10&\"-\"&'Timesheet raw data'!F10,\"\")","v":"Tenant2 Incident Management-2011-09"}]
{"$rows_left_out":298}
{"sheet":"Estimate to complete","index":5,"n_rows":31,"n_cols":7,"rows_kept":31,"cut":false,"hidden":false,"merged":[]}
["ETC"]
[null,"Project Estimate to Complete"]
[null,"Program:",{"$f":"Cover.ProgramName","v":"DEMO"}]
[]
[null,"Update estimate to complete for each project weekly!"]
[null,null,"Status for Project ","Tenant1"]
[null,"Role",{"$f":"E25","v":"Available MD"},{"$f":"E16","v":"Remaining work planned"},"Avail (+) MD / Overrun (-) MD","Hrl. Rates","Avail (+) Cost / Overrun (-) Cost"]
[null,"Project Manager",12.875,{"$f":"E17","v":11.4},{"$f":"C8-D8","v":1.4749999999999996},100,{"$f":"F8*8*E8","v":1179.9999999999998}]
[null,"Architect",1.84375,0,1.84375,96,1416]
[null,"Senior Consultant",7.25,10.5,-3.25,90,-2340]
{"$rows_left_out":22}
{"sheet":"Rolling plan","index":6,"n_rows":20,"n_cols":13,"rows_kept":20,"cut":false,"hidden":false,"merged":[]}
["rollingplan",""]
[null,"Rolling Plan"]
[null,"Program:",{"$f":"Cover.ProgramName","v":"DEMO"}]
[null,"Update rolling plan with cutomer weekly!",null,null,"Calendar Week",{"$f":"TRUNC((D5-DATE(YEAR(D5+3-MOD(D5-2,7)),1,MOD(D5-2,7)-9))/7)","v":48},null,null,null,{"$f":"rollingplan.WeekHeader","v":"Calendar Week"},{"$f":"TRUNC((I5-DATE(YEAR(I5+3-MOD(I5-2,7)),1,MOD(I5-2,7)-9))/7)","v":49}]
[null,"Project within Program",null,"2011-11-28","2011-11-29","2011-11-30","2011-12-01","2011-12-02","2011-12-05","2011-12-06","2011-12-07","2011-12-08","2011-12-09"]
[null,"Dev Env.",null,"CA Tenant 2\nDevelopment","CA Tenant 2\nDevelopment","CA Tenant 2\nDevelopment","CA Tenant 2\nDevelopment","CA Tenant 2\nDevelopment","CA Tenant 2\nDevelopment","CA Tenant 2\nDevelopment","CA Tenant 2\nDevelopment","CA Tenant 2\nDevelopment","CA Tenant 2\nDevelopment"]
[null,"QA Env.",null,"Free","CA Tenant2 Testing","CA Tenant2 Testing","CA Tenant2 Testing","CA Tenant2 Testing","CA Tenant2 Testing","CA Tenant2 Testing","CA Tenant2 Testing","CA Tenant2 Testing","CA Tenant2 Testing"]
[null,"Prod Env.",null,"Production","Production","Production","Production","Production","Production","Production","Production","Production","Production"]
[null,"Project-TM1 Tenant1","CA Resource","CA Architect1","CA Architect1\nCA Archtect2","CA Architect1\nCA Archtect2","CA Architect1\nCA Archtect2","CA Architect1\nCA Archtect2","CA Architect1","CA Architect1\nCA Archtect2"]
[null,"Project-TM1 Tenant1","Task(s)","Functional design for request and change managmeent","Requirement specification for request and change management","Requirement specification for request and change management","Requirement specification for request and change management","Requirement specification for request and change management","Review requirement specification","Requirement specification signoff"]
{"$rows_left_out":11}
{"sheet":"Traffic Light report","index":7,"n_rows":47,"n_cols":13,"rows_kept":47,"cut":false,"hidden":false,"merged":[[36,3,36,4],[42,3,42,4]]}
["traffic_light_report"]
[null,"Traffic Light Report",null,null,null,null,null,null,null,null,null,null,"Enter \"TLR_G\" for a green traffic light. \"TLR_Y\" / \"TLR_R\" for yellow and red.\nThen hit button \"Update Traffic Lights\""]
[null,"Program:",{"$f":"Cover.ProgramName","v":"DEMO"}]
[null,"Update traffic light report every month!"]
[null,"Program",null,null,null,null,null,"As of December 2011"]
[]
[null,"Expected program benefits",null,null,null,"Status",null,"Trend"]
[null,null,"Availability of resources","Prevent Incidents from happening and to minimize the Impact of Incidents that cannot be prevented.",null,"TLR_G",null,"TLR_G"]
[null,null,null,"< Enter short status in this line>"]
[null,null,"Roll Out capability","Integration of Service Desk with external systems \"A\" and \"B\". ",null,"TLR_G",null,"TLR_G"]
{"$rows_left_out":38}
{"sheet":"Scoreboard Risiken u. Chancen","index":8,"n_rows":24,"n_cols":29,"rows_kept":24,"cut":false,"hidden":false,"merged":[[13,3,14,4],[13,5,14,6],[13,7,14,8],[13,9,14,10],[13,11,14,12],[11,13,12,14],[11,15,12,16],[11,17,12,18],[13,19,14,20],[13,21,14,22],[11,19,12,20],[11,21,12,22],[13,13,14,14],[13,15,14,16],[13,17,14,18],[11,3,12,4],[11,5,12,6],[11,7,12,8],[11,9,12,10],[11,11,12,12],[7,21,8,22],[9,3,10,4],[9,5,10,6],[9,7,10,8],[9,9,10,10],[9,11,10,12],[9,13,10,14],[9,15,10,16],[9,17,10,18],[9,19,10,20],[9,21,10,22],[7,11,8,12],[7,13,8,14],[7,15,8,16],[7,17,8,18],[7,19,8,20],[4,1,15,1],[4,24,15,24],[5,3,6,4],[5,5,6,6],[5,7,6,8],[5,9,6,10],[5,11,6,12],[5,13,6,14],[5,15,6,16],[5,17,6,18],[5,19,6,20],[5,21,6,22],[7,3,8,4],[7,5,8,6],[7,7,8,8],[7,9,8,10]]}
[]
[null,"Scoreboard der Risiken und Chancen"]
[null,null,"Übersicht der Risiken",null,null,null,null,null,null,null,null,null,null,null,null,null,null,null,null,null,null,null,null,"Übersicht der Chancen",null,null,null,"percent ranges","exposure ranges"]
[null,null,null,"Auswirkungen",null,null,null,null,null,null,null,null,null,null,null,null,null,null,null,null,null,null,"Auswirkungen",null,null,null,null,15,2]
[null,"Wahrscheinlichkeit in %",null,{"$f":"D16","v":1},{"$f":"E16","v":2},3,4,5,6,7,8,9,10,10,9,8,7,6,5,4,3,2,1,null,"Wahrscheinlichkeit in %",null,null,35,4]
[null,null,100,{"$f":"COUNTIFS('Detailbewertung Risiken'!$D:$D, \">=\" & $C7, 'Detailbewertung Risiken'!$D:$D, \"<\" &$C6, 'Detailbewertung Risiken'!$E:$E,\">\"&D$16, 'Detailbewertung Risiken'!$E:$E,\"<=\" &E$16)","v":0},null,{"$f":"COUNTIFS('Detailbewertung Risiken'!$D:$D, \">=\" & $C7, 'Detailbewertung Risiken'!$D:$D, \"<\" &$C6, 'Detailbewertung Risiken'!$E:$E,\">\"&F$16, 'Detailbewertung Risiken'!$E:$E,\"<=\" &G$16)","v":0},null,{"$f":"COUNTIFS('Detailbewertung Risiken'!$D:$D, \">=\" & $C7, 'Detailbewertung Risiken'!$D:$D, \"<\" &$C6, 'Detailbewertung Risiken'!$E:$E,\">\"&H$16, 'Detailbewertung Risiken'!$E:$E,\"<=\" &I$16)","v":0},null,{"$f":"COUNTIFS('Detailbewertung Risiken'!$D:$D, \">=\" & $C7, 'Detailbewertung Risiken'!$D:$D, \"<\" &$C6, 'Detailbewertung Risiken'!$E:$E,\">\"&J$16, 'Detailbewertung Risiken'!$E:$E,\"<=\" &K$16)","v":0},null,{"$f":"COUNTIFS('Detailbewertung Risiken'!$D:$D, \">=\" & $C7, 'Detailbewertung Risiken'!$D:$D, \"<\" &$C6, 'Detailbewertung Risiken'!$E:$E,\">\"&L$16, 'Detailbewertung Risiken'!$E:$E,\"<=\" &M$16)","v":1},null,{"$f":"COUNTIFS('Detailbewertung Chancen'!$D:$D, \">=\" & $C7, 'Detailbewertung Chancen'!$D:$D, \"<\" &$C6, 'Detailbewertung Chancen'!$E:$E,\"<=\"&N$16, 'Detailbewertung Chancen'!$E:$E,\">\" &O$16)","v":0},null,{"$f":"COUNTIFS('Detailbewertung Chancen'!$D:$D, \">=\" & $C7, 'Detailbewertung Chancen'!$D:$D, \"<\" &$C6, 'Detailbewertung Chancen'!$E:$E,\"<=\"&P$16, 'Detailbewertung Chancen'!$E:$E,\">\" &Q$16)","v":1},null,{"$f":"COUNTIFS('Detailbewertung Chancen'!$D:$D, \">=\" & $C7, 'Detailbewertung Chancen'!$D:$D, \"<\" &$C6, 'Detailbewertung Chancen'!$E:$E,\"<=\"&R$16, 'Detailbewertung Chancen'!$E:$E,\">\" &S$16)","v":0},null,{"$f":"COUNTIFS('Detailbewertung Chancen'!$D:$D, \">=\" & $C7, 'Detailbewertung Chancen'!$D:$D, \"<\" &$C6, 'Detailbewertung Chancen'!$E:$E,\"<=\"&T$16, 'Detailbewertung Chancen'!$E:$E,\">\" &U$16)","v":0},null,{"$f":"COUNTIFS('Detailbewertung Chancen'!$D:$D, \">=\" & $C7, 'Detailbewertung Chancen'!$D:$D, \"<\" &$C6, 'Detailbewertung Chancen'!$E:$E,\"<=\"&V$16, 'Detailbewertung Chancen'!$E:$E,\">\" &W$16)","v":0},null,{"$f":"C6","v":100},null,null,null,65,6]
[null,null,81,null,null,null,null,null,null,null,null,null,null,null,null,null,null,null,null,null,null,null,null,81,null,null,null,85,8]
[null,null,80,{"$f":"COUNTIFS('Detailbewertung Risiken'!$D:$D, \">=\" & $C9, 'Detailbewertung Risiken'!$D:$D, \"<\" &$C8, 'Detailbewertung Risiken'!$E:$E,\">\"&D$16, 'Detailbewertung Risiken'!$E:$E,\"<=\" &E$16)","v":0},null,{"$f":"COUNTIFS('Detailbewertung Risiken'!$D:$D, \">=\" & $C9, 'Detailbewertung Risiken'!$D:$D, \"<\" &$C8, 'Detailbewertung Risiken'!$E:$E,\">\"&F$16, 'Detailbewertung Risiken'!$E:$E,\"<=\" &G$16)","v":0},null,{"$f":"COUNTIFS('Detailbewertung Risiken'!$D:$D, \">=\" & $C9, 'Detailbewertung Risiken'!$D:$D, \"<\" &$C8, 'Detailbewertung Risiken'!$E:$E,\">\"&H$16, 'Detailbewertung Risiken'!$E:$E,\"<=\" &I$16)","v":0},null,{"$f":"COUNTIFS('Detailbewertung Risiken'!$D:$D, \">=\" & $C9, 'Detailbewertung Risiken'!$D:$D, \"<\" &$C8, 'Detailbewertung Risiken'!$E:$E,\">\"&J$16, 'Detailbewertung Risiken'!$E:$E,\"<=\" &K$16)","v":0},null,{"$f":"COUNTIFS('Detailbewertung Risiken'!$D:$D, \">=\" & $C9, 'Detailbewertung Risiken'!$D:$D, \"<\" &$C8, 'Detailbewertung Risiken'!$E:$E,\">\"&L$16, 'Detailbewertung Risiken'!$E:$E,\"<=\" &M$16)","v":0},null,{"$f":"COUNTIFS('Detailbewertung Chancen'!$D:$D, \">=\" & $C9, 'Detailbewertung Chancen'!$D:$D, \"<\" &$C8, 'Detailbewertung Chancen'!$E:$E,\"<=\"&N$16, 'Detailbewertung Chancen'!$E:$E,\">\" &O$16)","v":0},null,{"$f":"COUNTIFS('Detailbewertung Chancen'!$D:$D, \">=\" & $C9, 'Detailbewertung Chancen'!$D:$D, \"<\" &$C8, 'Detailbewertung Chancen'!$E:$E,\"<=\"&P$16, 'Detailbewertung Chancen'!$E:$E,\">\" &Q$16)","v":0},null,{"$f":"COUNTIFS('Detailbewertung Chancen'!$D:$D, \">=\" & $C9, 'Detailbewertung Chancen'!$D:$D, \"<\" &$C8, 'Detailbewertung Chancen'!$E:$E,\"<=\"&R$16, 'Detailbewertung Chancen'!$E:$E,\">\" &S$16)","v":0},null,{"$f":"COUNTIFS('Detailbewertung Chancen'!$D:$D, \">=\" & $C9, 'Detailbewertung Chancen'!$D:$D, \"<\" &$C8, 'Detailbewertung Chancen'!$E:$E,\"<=\"&T$16, 'Detailbewertung Chancen'!$E:$E,\">\" &U$16)","v":0},null,{"$f":"COUNTIFS('Detailbewertung Chancen'!$D:$D, \">=\" & $C9, 'Detailbewertung Chancen'!$D:$D, \"<\" &$C8, 'Detailbewertung Chancen'!$E:$E,\"<=\"&V$16, 'Detailbewertung Chancen'!$E:$E,\">\" &W$16)","v":0},null,80,null,null,null,null,10]
[null,null,61,null,null,null,null,null,null,null,null,null,null,null,null,null,null,null,null,null,null,null,null,61]
[null,null,60,{"$f":"COUNTIFS('Detailbewertung Risiken'!$D:$D, \">=\" & $C11, 'Detailbewertung Risiken'!$D:$D, \"<\" &$C10, 'Detailbewertung Risiken'!$E:$E,\">\"&D$16, 'Detailbewertung Risiken'!$E:$E,\"<=\" &E$16)","v":0},null,{"$f":"COUNTIFS('Detailbewertung Risiken'!$D:$D, \">=\" & $C11, 'Detailbewertung Risiken'!$D:$D, \"<\" &$C10, 'Detailbewertung Risiken'!$E:$E,\">\"&F$16, 'Detailbewertung Risiken'!$E:$E,\"<=\" &G$16)","v":0},null,{"$f":"COUNTIFS('Detailbewertung Risiken'!$D:$D, \">=\" & $C11, 'Detailbewertung Risiken'!$D:$D, \"<\" &$C10, 'Detailbewertung Risiken'!$E:$E,\">\"&H$16, 'Detailbewertung Risiken'!$E:$E,\"<=\" &I$16)","v":0},null,{"$f":"COUNTIFS('Detailbewertung Risiken'!$D:$D, \">=\" & $C11, 'Detailbewertung Risiken'!$D:$D, \"<\" &$C10, 'Detailbewertung Risiken'!$E:$E,\">\"&J$16, 'Detailbewertung Risiken'!$E:$E,\"<=\" &K$16)","v":0},null,{"$f":"COUNTIFS('Detailbewertung Risiken'!$D:$D, \">=\" & $C11, 'Detailbewertung Risiken'!$D:$D, \"<\" &$C10, 'Detailbewertung Risiken'!$E:$E,\">\"&L$16, 'Detailbewertung Risiken'!$E:$E,\"<=\" &M$16)","v":0},null,{"$f":"COUNTIFS('Detailbewertung Chancen'!$D:$D, \">=\" & $C11, 'Detailbewertung Chancen'!$D:$D, \"<\" &$C10, 'Detailbewertung Chancen'!$E:$E,\"<=\"&N$16, 'Detailbewertung Chancen'!$E:$E,\">\" &O$16)","v":0},null,{"$f":"COUNTIFS('Detailbewertung Chancen'!$D:$D, \">=\" & $C11, 'Detailbewertung Chancen'!$D:$D, \"<\" &$C10, 'Detailbewertung Chancen'!$E:$E,\"<=\"&P$16, 'Detailbewertung Chancen'!$E:$E,\">\" &Q$16)","v":0},null,{"$f":"COUNTIFS('Detailbewertung Chancen'!$D:$D, \">=\" & $C11, 'Detailbewertung Chancen'!$D:$D, \"<\" &$C10, 'Detailbewertung Chancen'!$E:$E,\"<=\"&R$16, 'Detailbewertung Chancen'!$E:$E,\">\" &S$16)","v":0},null,{"$f":"COUNTIFS('Detailbewertung Chancen'!$D:$D, \">=\" & $C11, 'Detailbewertung Chancen'!$D:$D, \"<\" &$C10, 'Detailbewertung Chancen'!$E:$E,\"<=\"&T$16, 'Detailbewertung Chancen'!$E:$E,\">\" &U$16)","v":0},null,{"$f":"COUNTIFS('Detailbewertung Chancen'!$D:$D, \">=\" & $C11, 'Detailbewertung Chancen'!$D:$D, \"<\" &$C10, 'Detailbewertung Chancen'!$E:$E,\"<=\"&V$16, 'Detailbewertung Chancen'!$E:$E,\">\" &W$16)","v":0},null,60]
{"$rows_left_out":15}
{"sheet":"Erläuterung Risiken+Chancen","index":9,"n_rows":2,"n_cols":2,"rows_kept":2,"cut":false,"hidden":false,"merged":[]}
[]
[null,"Erläuterung der Risiken und Chancen"]

{"sheet":"Detailbewertung Risiken","index":10,"n_rows":6,"n_cols":16,"rows_kept":6,"cut":false,"hidden":false,"merged":[]}
[]
[null,"Detailbewertung der Risiken"]
[]
[null,"Nr.","Risiko","Wahrschein-\nlichkeit","Bewertung der Auswirkungen","Exposure","Auswirkungen","Maßnahmen","Verantwortlich","Typ ","Resourcen","Zeitbedarf","Funktion-\nalität",null,"Wahrscheinlichk.","Auswirk."]
[null,1,"Der Kunde benötigt deutschsprachige Benutzerschnittstellen da dies einer der wesentlichen Anforderungen des Kunden ist.",85,10,{"$f":"D5*E5/100","v":8.5},"Projektziel verfehlt. ","Projektleiter prüft dies, ob Support gewährleistet wird. Sonst Eskalation","Rudorfer","Scope"]
[null,2,"Verspätete Lieferung der Hardware",35,6,2.1]

{"sheet":"Detailbewertung Chancen","index":11,"n_rows":6,"n_cols":15,"rows_kept":6,"cut":false,"hidden":false,"merged":[]}
[]
[null,"Detailbewertung der Chancen"]
[]
[null,"Nr.","Opportunity","Wahrschein-\nlichkeit","Bewertung der Auswirkungen","Exposure","Auswirkungen","Maßnahmen","Verantwortlich","Typ ","Resourcen","Zeitbedarf","Funktion-\nalität","Wahrscheinlichk.","Auswirk."]
[null,2,"Erweiterung der Lösung auf die Länder Slowakei, Tschechien und Polen",85,8,{"$f":"D5*E5/100","v":6.8},"Redesign der zentralen Serverarchitektur","Pre-Salestermin mit den Ansprechpartnern in den jeweiligen Ländern","Rudorfer"]
[null,1,"Herstellung einer zentralen Sigle-Signon Lösung",35,4,1.4,"Verbesserung der Benutzerakzeptanz","Vorstellung der Lösung durch den Security-Architekten","Rudorfer"]